ParaView Superbuild

vtkm
tbb

(Sebastien Jourdain) #1

It seems pvbinsdash is still failing to produce binaries.

/opt/rh/devtoolset-4/root/usr/libexec/gcc/x86_64-redhat-linux/5.3.1/ld: cannot find libtbb.so.2
collect2: error: ld returned 1 exit status
gmake[5]: *** [VTK/ThirdParty/vtkm/vtk-m/lib/libvtkm_cont-pv5.5.so.1] Error 1
gmake[4]: *** [VTK/ThirdParty/vtkm/vtk-m/vtkm/cont/CMakeFiles/vtkm_cont.dir/all] Error 2
gmake[4]: *** Waiting for unfinished jobs…
gmake[3]: *** [all] Error 2
CMake Error at /home/buildslave/dashboards/buildbot/paraview-pvbinsdash-linux-shared-release_superbuild/build/superbuild/sb-paraview-build.cmake:47 (message):
Failed with exit code 2


(Shawn Waldon) #2

The last I know on this one is that I sshed in and grabbed the ParaView build’s CMakeCache that Rob asked me to send him last week. I haven’t heard anything more recently though.


(Utkarsh Ayachit) #3

Rob is on vacation this week. We should follow up with him once he’s back.